Project

General

Profile

build.log

Christian Kanzian, 02/17/2016 09:54 AM

 
1
Darktable build script
2

    
3
Building directory:  ./build
4
Installation prefix: /opt/darktable/
5
Build type:          Release
6
Make program:        make
7
Make tasks:          4
8

    
9

    
10
-- The CXX compiler identification is GNU 4.9.2
11
-- The C compiler identification is GNU 4.9.2
12
-- Check for working CXX compiler: /usr/bin/c++
13
-- Check for working CXX compiler: /usr/bin/c++ -- works
14
-- Detecting CXX compiler ABI info
15
-- Detecting CXX compiler ABI info - done
16
-- Check for working C compiler: /usr/bin/cc
17
-- Check for working C compiler: /usr/bin/cc -- works
18
-- Detecting C compiler ABI info
19
-- Detecting C compiler ABI info - done
20
-- Performing Test _MSSE2
21
-- Performing Test _MSSE2 - Success
22
-- Building SSE2-optimized codepaths: ON
23
-- Check if the system is big endian
24
-- Searching 16 bit integer
25
-- Looking for sys/types.h
26
-- Looking for sys/types.h - found
27
-- Looking for stdint.h
28
-- Looking for stdint.h - found
29
-- Looking for stddef.h
30
-- Looking for stddef.h - found
31
-- Check size of unsigned short
32
-- Check size of unsigned short - done
33
-- Using unsigned short
34
-- Check if the system is big endian - little endian
35
-- Found little endian system. Good.
36
-- multiarch triplet detected: x86_64-linux-gnu
37
-- Looking for external programs
38
-- Found perl
39
-- Found intltool-merge
40
-- Found xsltproc
41
-- Found xmllint
42
-- All external programs found
43
-- Found Gettext 
44
-- Found msgfmt to convert language file. Translation enabled
45
-- Try OpenMP C flag = [-fopenmp]
46
-- Performing Test OpenMP_FLAG_DETECTED
47
-- Performing Test OpenMP_FLAG_DETECTED - Success
48
-- Try OpenMP CXX flag = [-fopenmp]
49
-- Performing Test OpenMP_FLAG_DETECTED
50
-- Performing Test OpenMP_FLAG_DETECTED - Success
51
-- Found OpenMP: -fopenmp  
52
-- Found PkgConfig: /usr/bin/pkg-config (found version "0.28") 
53
-- checking for module 'gtk+-3.0'
54
--   found gtk+-3.0, version 3.14.5
55
-- checking for module 'gdk-pixbuf-2.0'
56
--   found gdk-pixbuf-2.0, version 2.31.1
57
-- checking for module 'glib-2.0'
58
--   found glib-2.0, version 2.42.1
59
-- Found Glib 
60
-- checking for module 'pango'
61
--   found pango, version 1.36.8
62
-- checking for module 'atk'
63
--   found atk, version 2.14.0
64
-- Found GTK3: /usr/lib/x86_64-linux-gnu/libgtk-3.so (Required is at least version "3.10") 
65
-- Found LibXml2: /usr/lib/x86_64-linux-gnu/libxml2.so (found suitable version "2.9.1", minimum required is "2.6") 
66
-- checking for one of the modules 'libsoup-2.4;libsoup2'
67
-- checking for one of the modules 'libsoup-2.2;libsoup2'
68
-- checking for module 'libgphoto2'
69
--   found libgphoto2, version 2.5.4
70
-- Found GPHOTO2: /usr/lib/x86_64-linux-gnu/libgphoto2.so  
71
-- Found OPENEXR: /usr/lib/x86_64-linux-gnu/libIlmImf.so;/usr/lib/x86_64-linux-gnu/libImath.so;/usr/lib/x86_64-linux-gnu/libIex.so;/usr/lib/x86_64-linux-gnu/libIlmThread.so  
72
-- checking for module 'libwebp'
73
--   package 'libwebp' not found
74
-- Could NOT find WEBP (missing:  WEBP_LIBRARY WEBP_INCLUDE_DIR) (Required is at least version "0.3.0")
75
-- checking for module 'lensfun'
76
--   found lensfun, version 0.2.8.0
77
-- Found LENSFUN: /usr/lib/liblensfun.so  
78
-- checking for module 'gio-2.0'
79
--   found gio-2.0, version 2.42.1
80
-- Found GIO 
81
-- Found GThread: /usr/lib/x86_64-linux-gnu/libgthread-2.0.so  
82
-- Found GModule: /usr/lib/x86_64-linux-gnu/libgmodule-2.0.so  
83
-- Found PANGOCAIRO: /usr/lib/x86_64-linux-gnu/libpangocairo-1.0.so  
84
-- Found PThread: /usr/lib/x86_64-linux-gnu/libpthread.so  
85
-- Found RSVG2: /usr/lib/x86_64-linux-gnu/librsvg-2.so  
86
-- Found LibXml2: /usr/lib/x86_64-linux-gnu/libxml2.so (found version "2.9.1") 
87
-- Found SQLITE3: /usr/lib/x86_64-linux-gnu/libsqlite3.so  
88
-- Found CURL: /usr/lib/x86_64-linux-gnu/libcurl.so (found version "7.38.0") 
89
-- Found ZLIB: /usr/lib/x86_64-linux-gnu/libz.so (found version "1.2.8") 
90
-- Found PNG: /usr/lib/x86_64-linux-gnu/libpng.so (found version "1.2.50") 
91
-- Found JPEG: /usr/lib/x86_64-linux-gnu/libjpeg.so  
92
-- Found TIFF: /usr/lib/x86_64-linux-gnu/libtiff.so (found version "4.0.3") 
93
-- Found LCMS2: /usr/lib/x86_64-linux-gnu/liblcms2.so  
94
-- checking for module 'json-glib-1.0'
95
--   found json-glib-1.0, version 1.0.2
96
-- Found JsonGlib 
97
-- checking for module 'exiv2'
98
--   found exiv2, version 0.24
99
-- Found EXIV2: /usr/lib/x86_64-linux-gnu/libexiv2.so  
100
-- Internationalization: Enabled
101
-- Found FLICKCURL: /usr/lib/x86_64-linux-gnu/libflickcurl.so  
102
-- checking for module 'libopenjpeg1'
103
--   package 'libopenjpeg1' not found
104
-- Could NOT find OpenJPEG (missing:  OPENJPEG_LIBRARY OPENJPEG_INCLUDE_DIR) 
105
-- checking for module 'libsecret-1'
106
--   found libsecret-1, version 0.18
107
-- Found LIBSECRET: /usr/include/libsecret-1;/usr/include/glib-2.0;/usr/lib/x86_64-linux-gnu/glib-2.0/include  
108
-- checking for module 'GraphicsMagick'
109
--   package 'GraphicsMagick' not found
110
-- Performing Test HAVE_BUILTIN_CPU_SUPPORTS
111
-- Performing Test HAVE_BUILTIN_CPU_SUPPORTS - Success
112
-- Does the compiler support __builtin_cpu_supports(): 1
113
-- Checking for -march=native support
114
-- Performing Test MARCHNATIVE
115
-- Performing Test MARCHNATIVE - Success
116
-- checking for one of the modules 'lua52;lua5.2;lua-5.2;lua'
117
-- Lua support: Enabled
118
-- Found Pugixml: /usr/lib/x86_64-linux-gnu/libpugixml.so (Required is at least version "1.2") 
119
-- checking for module 'osmgpsmap-1.0'
120
--   found osmgpsmap-1.0, version 1.0.2
121
-- Map mode: enabled
122
-- checking for module 'colord'
123
--   found colord, version 1.2.1
124
-- checking for module 'colord-gtk'
125
--   found colord-gtk, version 0.1.25
126
-- Could NOT find CUPS (missing:  CUPS_LIBRARY CUPS_INCLUDE_DIR) 
127
-- Print mode: disabled, please install CUPS dev package
128
-- Looking for XOpenDisplay in /usr/lib/x86_64-linux-gnu/libX11.so;/usr/lib/x86_64-linux-gnu/libXext.so
129
-- Looking for XOpenDisplay in /usr/lib/x86_64-linux-gnu/libX11.so;/usr/lib/x86_64-linux-gnu/libXext.so - found
130
-- Looking for gethostbyname
131
-- Looking for gethostbyname - found
132
-- Looking for connect
133
-- Looking for connect - found
134
-- Looking for remove
135
-- Looking for remove - found
136
-- Looking for shmat
137
-- Looking for shmat - found
138
-- Looking for IceConnectionNumber in ICE
139
-- Looking for IceConnectionNumber in ICE - found
140
-- Found X11: /usr/lib/x86_64-linux-gnu/libX11.so
141
-- building darktable-cmstest with colord support. nice.
142
-- Looking for include file pthread.h
143
-- Looking for include file pthread.h - found
144
-- Looking for pthread_create
145
-- Looking for pthread_create - found
146
-- Found Threads: TRUE  
147
-- Could NOT find SDL (missing:  SDL_LIBRARY SDL_INCLUDE_DIR) 
148
-- Found OpenGL: /usr/lib/x86_64-linux-gnu/libGL.so  
149
-- 
150
-- Could NOT find Java (missing:  Java_JAR_EXECUTABLE Java_JAVAC_EXECUTABLE Java_JAVAH_EXECUTABLE Java_JAVADOC_EXECUTABLE) (found version "1.7.0.91")
151
Missing po4a-translate. Can NOT create translated manpages
152
Missing po4a-updatepo. Can NOT update manpage translations
153
-- Configuring done
154
-- Generating done
155
-- Build files have been written to: /home/chri/Linux/darktable/build
156
Scanning dependencies of target locale_cs
157
Scanning dependencies of target locale_af
158
Scanning dependencies of target generate_version
159
Scanning dependencies of target locale_ca
160
[  0%] [  0%] [  0%] Updating version string
161
Building cs locale
162
Building af locale
163
[  0%] Building ca locale
164
166 übersetzte Meldungen, 2093 unübersetzte Meldungen.
165
2030 übersetzte Meldungen.
166
2037 übersetzte Meldungen.
167
[  0%] [  0%] Built target locale_cs
168
Built target locale_af
169
[  0%] [  0%] Built target generate_version
170
Built target locale_ca
171
Scanning dependencies of target locale_da
172
Scanning dependencies of target locale_de
173
Scanning dependencies of target locale_es
174
Scanning dependencies of target locale_el
175
[  0%] [  0%] [  0%] [  1%] Building da locale
176
Building de locale
177
Building es locale
178
Building el locale
179
2060 übersetzte Meldungen, 13 ungenaue Übersetzungen, 15 unübersetzte Meldungen.
180
2006 übersetzte Meldungen, 1 ungenaue Übersetzung, 29 unübersetzte Meldungen.
181
1975 übersetzte Meldungen.
182
[  1%] Built target locale_de
183
[  1%] Built target locale_el
184
[  1%] Built target locale_da
185
Scanning dependencies of target locale_fi
186
2052 übersetzte Meldungen.
187
Scanning dependencies of target locale_fr
188
Scanning dependencies of target locale_gl
189
[  1%] [  1%] Built target locale_es
190
[  1%] [  1%] Building fi locale
191
Scanning dependencies of target locale_hu
192
Building fr locale
193
Building gl locale
194
[  1%] Building hu locale
195
613 übersetzte Meldungen, 551 ungenaue Übersetzungen, 454 unübersetzte Meldungen.
196
[  1%] Built target locale_fi
197
2109 übersetzte Meldungen, 2 unübersetzte Meldungen.
198
Scanning dependencies of target locale_it
199
398 übersetzte Meldungen, 591 ungenaue Übersetzungen, 629 unübersetzte Meldungen.
200
[  1%] Built target locale_fr
201
[  1%] [  1%] Built target locale_gl
202
2029 übersetzte Meldungen, 9 ungenaue Übersetzungen.
203
Building it locale
204
[  1%] Scanning dependencies of target locale_ja
205
Built target locale_hu
206
Scanning dependencies of target locale_nl
207
[  1%] Scanning dependencies of target locale_pl
208
[  1%] Building ja locale
209
[  3%] Building pl locale
210
2034 übersetzte Meldungen.
211
Building nl locale
212
[  3%] Built target locale_it
213
2036 übersetzte Meldungen.
214
[  3%] Scanning dependencies of target locale_pt_BR
215
1744 übersetzte Meldungen.
216
Built target locale_ja
217
[  3%] [  3%] Built target locale_pl
218
Scanning dependencies of target locale_pt_PT
219
Building pt_BR locale
220
[  3%] Scanning dependencies of target locale_ro
221
2078 übersetzte Meldungen.
222
Building pt_PT locale
223
[  3%] [  3%] Built target locale_nl
224
Building ro locale
225
Scanning dependencies of target locale_ru
226
[  3%] 1739 übersetzte Meldungen, 1 ungenaue Übersetzung, 4 unübersetzte Meldungen.
227
Building ru locale
228
713 übersetzte Meldungen, 490 ungenaue Übersetzungen, 415 unübersetzte Meldungen.
229
[  3%] Built target locale_pt_PT
230
1752 übersetzte Meldungen.
231
[  3%] Built target locale_ro
232
[  3%] Scanning dependencies of target locale_sk
233
Built target locale_pt_BR
234
Scanning dependencies of target locale_sq
235
Scanning dependencies of target locale_sv
236
[  3%] [  5%] Building sq locale
237
[  5%] Building sv locale
238
1876 übersetzte Meldungen, 73 ungenaue Übersetzungen, 88 unübersetzte Meldungen.
239
Building sk locale
240
[  5%] Built target locale_ru
241
Scanning dependencies of target locale_th
242
1824 übersetzte Meldungen, 7 ungenaue Übersetzungen, 10 unübersetzte Meldungen.
243
[  5%] [  5%] Built target locale_sq
244
Building th locale
245
2077 übersetzte Meldungen, 1 unübersetzte Meldung.
246
Scanning dependencies of target locale_uk
247
[  5%] Built target locale_sv
248
[  5%] Building uk locale
249
Scanning dependencies of target locale_zh_CN
250
2036 übersetzte Meldungen, 1 unübersetzte Meldung.
251
530 übersetzte Meldungen, 2 ungenaue Übersetzungen, 1098 unübersetzte Meldungen.
252
[  5%] [  5%] [  5%] Built target locale_sk
253
Built target locale_th
254
Building zh_CN locale
255
Scanning dependencies of target lautoc
256
[  5%] Building C object src/external/LuaAutoC/CMakeFiles/lautoc.dir/lautoc.c.o
257
1518 übersetzte Meldungen, 74 ungenaue Übersetzungen, 26 unübersetzte Meldungen.
258
[  5%] Built target locale_zh_CN
259
[  5%] Generating metadata_gen.h, metadata_gen.c
260
1838 übersetzte Meldungen, 3 ungenaue Übersetzungen.
261
[  5%] Built target locale_uk
262
Scanning dependencies of target rawspeed
263
Scanning dependencies of target metadata_dummy
264
Scanning dependencies of target darktable-cmstest
265
[  5%] Building CXX object src/external/rawspeed/CMakeFiles/rawspeed.dir/RawSpeed/CiffIFD.cpp.o
266
[  5%] [  5%] Building C object src/cmstest/CMakeFiles/darktable-cmstest.dir/main.c.o
267
Building C object src/CMakeFiles/metadata_dummy.dir/metadata_gen.c.o
268
Linking C static library libmetadata_dummy.a
269
[  5%] Built target metadata_dummy
270
Linking C executable darktable-cmstest
271
Linking C static library liblautoc.a
272
Scanning dependencies of target darktable.appdata_file
273
[  5%] Generating darktable.appdata.xml
274
[  5%] Built target lautoc
275
Scanning dependencies of target darktable.desktop_file
276
[  5%] Generating darktable.desktop
277
[  5%] Built target darktable-cmstest
278
Scanning dependencies of target darktablerc_file
279
[  5%] Generating darktablerc
280
[  5%] Built target darktablerc_file
281
Scanning dependencies of target darktablerc.html_file
282
[  5%] Generating darktablerc.html
283
[  5%] Built target darktablerc.html_file
284
Scanning dependencies of target manpage_darktable-cli.1
285
[  5%] Generating darktable-cli.1
286
[  5%] Built target manpage_darktable-cli.1
287
Scanning dependencies of target manpage_darktable-cltest.1
288
[  5%] Generating darktable-cltest.1
289
[  5%] Built target manpage_darktable-cltest.1
290
Scanning dependencies of target manpage_darktable-cmstest.1
291
[  5%] Generating darktable-cmstest.1
292
[  5%] Built target manpage_darktable-cmstest.1
293
[  5%] Building CXX object src/external/rawspeed/CMakeFiles/rawspeed.dir/RawSpeed/ByteStream.cpp.o
294
Scanning dependencies of target manpage_darktable-generate-cache.1
295
[  5%] Merging translations into /home/chri/Linux/darktable/build/data/darktable.appdata.xml.
296
CREATED /home/chri/Linux/darktable/build/data/darktable.appdata.xml
297
Merging translations into /home/chri/Linux/darktable/build/data/darktable.desktop.
298
[  5%] Built target darktable.appdata_file
299
Generating darktable-generate-cache.1
300
[  5%] Scanning dependencies of target manpage_darktable-viewer.1
301
Built target darktable.desktop_file
302
[  5%] Generating darktable-viewer.1
303
Scanning dependencies of target manpage_darktable.1
304
[  5%] Generating darktable.1
305
[  5%] Built target manpage_darktable-generate-cache.1
306
[  7%] Building CXX object src/external/rawspeed/CMakeFiles/rawspeed.dir/RawSpeed/LJpegDecompressor.cpp.o
307
[  7%] Built target manpage_darktable-viewer.1
308
[  7%] Building CXX object src/external/rawspeed/CMakeFiles/rawspeed.dir/RawSpeed/ArwDecoder.cpp.o
309
[  7%] Built target manpage_darktable.1
310
Scanning dependencies of target manpages
311
[  7%] Built target manpages
312
[  7%] Building CXX object src/external/rawspeed/CMakeFiles/rawspeed.dir/RawSpeed/TiffEntry.cpp.o
313
[  7%] Building CXX object src/external/rawspeed/CMakeFiles/rawspeed.dir/RawSpeed/PefDecoder.cpp.o
314
[  7%] Building CXX object src/external/rawspeed/CMakeFiles/rawspeed.dir/RawSpeed/ColorFilterArray.cpp.o
315
[  7%] Building CXX object src/external/rawspeed/CMakeFiles/rawspeed.dir/RawSpeed/OrfDecoder.cpp.o
316
[  7%] Building CXX object src/external/rawspeed/CMakeFiles/rawspeed.dir/RawSpeed/AriDecoder.cpp.o
317
[  8%] Building CXX object src/external/rawspeed/CMakeFiles/rawspeed.dir/RawSpeed/TiffEntryBE.cpp.o
318
[  8%] Building CXX object src/external/rawspeed/CMakeFiles/rawspeed.dir/RawSpeed/NikonDecompressor.cpp.o
319
[  8%] Building CXX object src/external/rawspeed/CMakeFiles/rawspeed.dir/RawSpeed/ThreefrDecoder.cpp.o
320
[  8%] Building CXX object src/external/rawspeed/CMakeFiles/rawspeed.dir/RawSpeed/FileMap.cpp.o
321
[  8%] Building CXX object src/external/rawspeed/CMakeFiles/rawspeed.dir/RawSpeed/TiffIFD.cpp.o
322
[  8%] Building CXX object src/external/rawspeed/CMakeFiles/rawspeed.dir/RawSpeed/Rw2Decoder.cpp.o
323
[  8%] Building CXX object src/external/rawspeed/CMakeFiles/rawspeed.dir/RawSpeed/MosDecoder.cpp.o
324
[  8%] Building CXX object src/external/rawspeed/CMakeFiles/rawspeed.dir/RawSpeed/CameraSensorInfo.cpp.o
325
[ 10%] Building CXX object src/external/rawspeed/CMakeFiles/rawspeed.dir/RawSpeed/RawDecoder.cpp.o
326
[ 10%] Building CXX object src/external/rawspeed/CMakeFiles/rawspeed.dir/RawSpeed/BitPumpMSB.cpp.o
327
[ 10%] Building CXX object src/external/rawspeed/CMakeFiles/rawspeed.dir/RawSpeed/CiffParser.cpp.o
328
[ 10%] Building CXX object src/external/rawspeed/CMakeFiles/rawspeed.dir/RawSpeed/DcsDecoder.cpp.o
329
[ 10%] Building CXX object src/external/rawspeed/CMakeFiles/rawspeed.dir/RawSpeed/KdcDecoder.cpp.o
330
[ 10%] Building CXX object src/external/rawspeed/CMakeFiles/rawspeed.dir/RawSpeed/HasselbladDecompressor.cpp.o
331
[ 10%] Building CXX object src/external/rawspeed/CMakeFiles/rawspeed.dir/RawSpeed/X3fParser.cpp.o
332
[ 10%] Building CXX object src/external/rawspeed/CMakeFiles/rawspeed.dir/RawSpeed/DcrDecoder.cpp.o
333
[ 12%] Building CXX object src/external/rawspeed/CMakeFiles/rawspeed.dir/RawSpeed/BitPumpMSB32.cpp.o
334
[ 12%] Building CXX object src/external/rawspeed/CMakeFiles/rawspeed.dir/RawSpeed/DngDecoderSlices.cpp.o
335
[ 12%] Building CXX object src/external/rawspeed/CMakeFiles/rawspeed.dir/RawSpeed/FileIOException.cpp.o
336
[ 12%] Building CXX object src/external/rawspeed/CMakeFiles/rawspeed.dir/RawSpeed/BlackArea.cpp.o
337
[ 12%] Building CXX object src/external/rawspeed/CMakeFiles/rawspeed.dir/RawSpeed/TiffParserHeaderless.cpp.o
338
[ 12%] Building CXX object src/external/rawspeed/CMakeFiles/rawspeed.dir/RawSpeed/DngOpcodes.cpp.o
339
[ 12%] Building CXX object src/external/rawspeed/CMakeFiles/rawspeed.dir/RawSpeed/NakedDecoder.cpp.o
340
[ 14%] Building CXX object src/external/rawspeed/CMakeFiles/rawspeed.dir/RawSpeed/BitPumpMSB16.cpp.o
341
[ 14%] Building CXX object src/external/rawspeed/CMakeFiles/rawspeed.dir/RawSpeed/FileWriter.cpp.o
342
[ 14%] Building CXX object src/external/rawspeed/CMakeFiles/rawspeed.dir/RawSpeed/X3fDecoder.cpp.o
343
[ 14%] Building CXX object src/external/rawspeed/CMakeFiles/rawspeed.dir/RawSpeed/FileReader.cpp.o
344
[ 14%] Building CXX object src/external/rawspeed/CMakeFiles/rawspeed.dir/RawSpeed/SrwDecoder.cpp.o
345
[ 14%] Building CXX object src/external/rawspeed/CMakeFiles/rawspeed.dir/RawSpeed/TiffParser.cpp.o
346
[ 14%] Building CXX object src/external/rawspeed/CMakeFiles/rawspeed.dir/RawSpeed/NefDecoder.cpp.o
347
[ 14%] Building CXX object src/external/rawspeed/CMakeFiles/rawspeed.dir/RawSpeed/StdAfx.cpp.o
348
[ 16%] Building CXX object src/external/rawspeed/CMakeFiles/rawspeed.dir/RawSpeed/RawImageDataFloat.cpp.o
349
[ 16%] Building CXX object src/external/rawspeed/CMakeFiles/rawspeed.dir/RawSpeed/MefDecoder.cpp.o
350
[ 16%] Building CXX object src/external/rawspeed/CMakeFiles/rawspeed.dir/RawSpeed/CiffParserException.cpp.o
351
[ 16%] Building CXX object src/external/rawspeed/CMakeFiles/rawspeed.dir/RawSpeed/CameraMetaData.cpp.o
352
[ 16%] Building CXX object src/external/rawspeed/CMakeFiles/rawspeed.dir/RawSpeed/RawDecoderException.cpp.o
353
[ 16%] Building CXX object src/external/rawspeed/CMakeFiles/rawspeed.dir/RawSpeed/ByteStreamSwap.cpp.o
354
[ 16%] Building CXX object src/external/rawspeed/CMakeFiles/rawspeed.dir/RawSpeed/TiffParserException.cpp.o
355
[ 17%] Building CXX object src/external/rawspeed/CMakeFiles/rawspeed.dir/RawSpeed/CrwDecoder.cpp.o
356
[ 17%] Building CXX object src/external/rawspeed/CMakeFiles/rawspeed.dir/RawSpeed/Camera.cpp.o
357
[ 17%] Building CXX object src/external/rawspeed/CMakeFiles/rawspeed.dir/RawSpeed/RawImage.cpp.o
358
[ 17%] Building CXX object src/external/rawspeed/CMakeFiles/rawspeed.dir/RawSpeed/Common.cpp.o
359
[ 17%] Building CXX object src/external/rawspeed/CMakeFiles/rawspeed.dir/RawSpeed/CiffEntry.cpp.o
360
[ 17%] Building CXX object src/external/rawspeed/CMakeFiles/rawspeed.dir/RawSpeed/PentaxDecompressor.cpp.o
361
[ 17%] Building CXX object src/external/rawspeed/CMakeFiles/rawspeed.dir/RawSpeed/MrwDecoder.cpp.o
362
[ 17%] Building CXX object src/external/rawspeed/CMakeFiles/rawspeed.dir/RawSpeed/TiffIFDBE.cpp.o
363
[ 19%] Building CXX object src/external/rawspeed/CMakeFiles/rawspeed.dir/RawSpeed/BitPumpPlain.cpp.o
364
[ 19%] Building CXX object src/external/rawspeed/CMakeFiles/rawspeed.dir/RawSpeed/ErfDecoder.cpp.o
365
[ 19%] Building CXX object src/external/rawspeed/CMakeFiles/rawspeed.dir/RawSpeed/Cr2Decoder.cpp.o
366
[ 19%] Building CXX object src/external/rawspeed/CMakeFiles/rawspeed.dir/RawSpeed/RafDecoder.cpp.o
367
[ 19%] Building CXX object src/external/rawspeed/CMakeFiles/rawspeed.dir/RawSpeed/DngDecoder.cpp.o
368
[ 19%] Building CXX object src/external/rawspeed/CMakeFiles/rawspeed.dir/RawSpeed/RawImageDataU16.cpp.o
369
[ 19%] Building CXX object src/external/rawspeed/CMakeFiles/rawspeed.dir/RawSpeed/LJpegPlain.cpp.o
370
[ 19%] Building CXX object src/external/rawspeed/CMakeFiles/rawspeed.dir/RawSpeed/BitPumpJPEG.cpp.o
371
[ 21%] Building CXX object src/external/rawspeed/CMakeFiles/rawspeed.dir/RawSpeed/IOException.cpp.o
372
[ 21%] Building CXX object src/external/rawspeed/CMakeFiles/rawspeed.dir/RawSpeed/CameraMetadataException.cpp.o
373
[ 21%] Building CXX object src/external/rawspeed/CMakeFiles/rawspeed.dir/RawSpeed/RawParser.cpp.o
374
Linking CXX static library librawspeed.a
375
[ 21%] Built target rawspeed
376
[ 23%] Generating preferences_gen.h
377
Scanning dependencies of target lib_darktable
378
[ 23%] [ 23%] Building C object src/CMakeFiles/lib_darktable.dir/metadata_gen.c.o
379
[ 23%] [ 23%] Building C object src/CMakeFiles/lib_darktable.dir/common/calculator.c.o
380
Building C object src/CMakeFiles/lib_darktable.dir/bauhaus/bauhaus.c.o
381
Building C object src/CMakeFiles/lib_darktable.dir/common/cache.c.o
382
[ 23%] Building C object src/CMakeFiles/lib_darktable.dir/common/collection.c.o
383
[ 25%] Building C object src/CMakeFiles/lib_darktable.dir/common/colorlabels.c.o
384
[ 25%] Building C object src/CMakeFiles/lib_darktable.dir/common/colorspaces.c.o
385
[ 25%] Building C object src/CMakeFiles/lib_darktable.dir/common/curve_tools.c.o
386
[ 25%] Building C object src/CMakeFiles/lib_darktable.dir/common/cpuid.c.o
387
[ 25%] Building C object src/CMakeFiles/lib_darktable.dir/common/darktable.c.o
388
[ 25%] Building C object src/CMakeFiles/lib_darktable.dir/common/database.c.o
389
[ 25%] Building C object src/CMakeFiles/lib_darktable.dir/common/dbus.c.o
390
[ 25%] Building CXX object src/CMakeFiles/lib_darktable.dir/common/exif.cc.o
391
[ 26%] Building C object src/CMakeFiles/lib_darktable.dir/common/film.c.o
392
[ 26%] Building C object src/CMakeFiles/lib_darktable.dir/common/file_location.c.o
393
[ 26%] Building C object src/CMakeFiles/lib_darktable.dir/common/fswatch.c.o
394
[ 26%] Building C object src/CMakeFiles/lib_darktable.dir/common/gaussian.c.o
395
[ 26%] Building C object src/CMakeFiles/lib_darktable.dir/common/grouping.c.o
396
[ 26%] Building C object src/CMakeFiles/lib_darktable.dir/common/history.c.o
397
[ 26%] Building C object src/CMakeFiles/lib_darktable.dir/common/gpx.c.o
398
[ 28%] Building C object src/CMakeFiles/lib_darktable.dir/common/image.c.o
399
[ 28%] Building C object src/CMakeFiles/lib_darktable.dir/common/image_cache.c.o
400
[ 28%] Building C object src/CMakeFiles/lib_darktable.dir/common/image_compression.c.o
401
[ 28%] Building C object src/CMakeFiles/lib_darktable.dir/common/imageio.c.o
402
[ 28%] Building C object src/CMakeFiles/lib_darktable.dir/common/imageio_jpeg.c.o
403
[ 28%] Building C object src/CMakeFiles/lib_darktable.dir/common/imageio_png.c.o
404
[ 28%] Building C object src/CMakeFiles/lib_darktable.dir/common/imageio_module.c.o
405
[ 28%] Building C object src/CMakeFiles/lib_darktable.dir/common/imageio_pfm.c.o
406
[ 30%] Building C object src/CMakeFiles/lib_darktable.dir/common/imageio_rgbe.c.o
407
[ 30%] Building C object src/CMakeFiles/lib_darktable.dir/common/imageio_tiff.c.o
408
[ 30%] Building C object src/CMakeFiles/lib_darktable.dir/common/imageio_gm.c.o
409
[ 30%] Building CXX object src/CMakeFiles/lib_darktable.dir/common/imageio_rawspeed.cc.o
410
[ 30%] Building C object src/CMakeFiles/lib_darktable.dir/common/import_session.c.o
411
[ 30%] Building C object src/CMakeFiles/lib_darktable.dir/common/interpolation.c.o
412
[ 30%] Building C object src/CMakeFiles/lib_darktable.dir/common/metadata.c.o
413
[ 30%] Building C object src/CMakeFiles/lib_darktable.dir/common/mipmap_cache.c.o
414
[ 32%] Building C object src/CMakeFiles/lib_darktable.dir/common/noiseprofiles.c.o
415
[ 32%] Building C object src/CMakeFiles/lib_darktable.dir/common/pdf.c.o
416
[ 32%] Building C object src/CMakeFiles/lib_darktable.dir/common/styles.c.o
417
[ 32%] Building C object src/CMakeFiles/lib_darktable.dir/common/selection.c.o
418
[ 32%] Building C object src/CMakeFiles/lib_darktable.dir/common/tags.c.o
419
[ 32%] Building C object src/CMakeFiles/lib_darktable.dir/common/utility.c.o
420
[ 32%] Building C object src/CMakeFiles/lib_darktable.dir/common/variables.c.o
421
[ 33%] [ 33%] Building C object src/CMakeFiles/lib_darktable.dir/common/pwstorage/backend_kwallet.c.o
422
Building C object src/CMakeFiles/lib_darktable.dir/common/pwstorage/pwstorage.c.o
423
[ 33%] Building C object src/CMakeFiles/lib_darktable.dir/common/opencl.c.o
424
[ 33%] Building C object src/CMakeFiles/lib_darktable.dir/common/dynload.c.o
425
[ 33%] Building C object src/CMakeFiles/lib_darktable.dir/common/dlopencl.c.o
426
[ 33%] Building C object src/CMakeFiles/lib_darktable.dir/common/ratings.c.o
427
[ 33%] Building C object src/CMakeFiles/lib_darktable.dir/common/histogram.c.o
428
[ 33%] Building C object src/CMakeFiles/lib_darktable.dir/control/control.c.o
429
[ 35%] Building C object src/CMakeFiles/lib_darktable.dir/control/crawler.c.o
430
[ 35%] [ 35%] Building C object src/CMakeFiles/lib_darktable.dir/control/jobs.c.o
431
Building C object src/CMakeFiles/lib_darktable.dir/control/jobs/control_jobs.c.o
432
[ 35%] Building C object src/CMakeFiles/lib_darktable.dir/control/jobs/develop_jobs.c.o
433
[ 35%] Building C object src/CMakeFiles/lib_darktable.dir/control/jobs/film_jobs.c.o
434
[ 35%] Building C object src/CMakeFiles/lib_darktable.dir/control/jobs/image_jobs.c.o
435
[ 35%] Building C object src/CMakeFiles/lib_darktable.dir/control/progress.c.o
436
[ 37%] Building C object src/CMakeFiles/lib_darktable.dir/control/signal.c.o
437
[ 37%] Building C object src/CMakeFiles/lib_darktable.dir/develop/develop.c.o
438
[ 37%] Building C object src/CMakeFiles/lib_darktable.dir/develop/imageop.c.o
439
[ 37%] Building C object src/CMakeFiles/lib_darktable.dir/develop/imageop_math.c.o
440
[ 37%] Building C object src/CMakeFiles/lib_darktable.dir/develop/lightroom.c.o
441
[ 37%] Building C object src/CMakeFiles/lib_darktable.dir/develop/pixelpipe.c.o
442
[ 37%] Building C object src/CMakeFiles/lib_darktable.dir/develop/blend.c.o
443
[ 37%] Building C object src/CMakeFiles/lib_darktable.dir/develop/blend_gui.c.o
444
[ 39%] Building C object src/CMakeFiles/lib_darktable.dir/develop/tiling.c.o
445
[ 39%] Building C object src/CMakeFiles/lib_darktable.dir/develop/masks/masks.c.o
446
[ 39%] Building C object src/CMakeFiles/lib_darktable.dir/dtgtk/button.c.o
447
[ 39%] Building C object src/CMakeFiles/lib_darktable.dir/dtgtk/drawingarea.c.o
448
[ 39%] Building C object src/CMakeFiles/lib_darktable.dir/dtgtk/expander.c.o
449
[ 39%] Building C object src/CMakeFiles/lib_darktable.dir/dtgtk/gradientslider.c.o
450
[ 39%] Building C object src/CMakeFiles/lib_darktable.dir/dtgtk/icon.c.o
451
[ 39%] Building C object src/CMakeFiles/lib_darktable.dir/dtgtk/paint.c.o
452
[ 41%] Building C object src/CMakeFiles/lib_darktable.dir/dtgtk/resetlabel.c.o
453
[ 41%] Building C object src/CMakeFiles/lib_darktable.dir/dtgtk/sidepanel.c.o
454
[ 41%] Building C object src/CMakeFiles/lib_darktable.dir/dtgtk/togglebutton.c.o
455
[ 41%] Building C object src/CMakeFiles/lib_darktable.dir/gui/accelerators.c.o
456
[ 41%] Building C object src/CMakeFiles/lib_darktable.dir/gui/gtkentry.c.o
457
[ 41%] Building C object src/CMakeFiles/lib_darktable.dir/gui/guides.c.o
458
[ 41%] Building C object src/CMakeFiles/lib_darktable.dir/gui/gtk.c.o
459
[ 42%] Building C object src/CMakeFiles/lib_darktable.dir/gui/hist_dialog.c.o
460
[ 42%] Building C object src/CMakeFiles/lib_darktable.dir/gui/preferences.c.o
461
[ 42%] Building C object src/CMakeFiles/lib_darktable.dir/gui/presets.c.o
462
[ 42%] Building C object src/CMakeFiles/lib_darktable.dir/gui/styles_dialog.c.o
463
[ 42%] Building C object src/CMakeFiles/lib_darktable.dir/libs/lib.c.o
464
[ 42%] Building C object src/CMakeFiles/lib_darktable.dir/views/view.c.o
465
[ 42%] Building C object src/CMakeFiles/lib_darktable.dir/views/undo.c.o
466
[ 42%] Building C object src/CMakeFiles/lib_darktable.dir/common/http_server.c.o
467
[ 44%] Building CXX object src/CMakeFiles/lib_darktable.dir/common/imageio_exr.cc.o
468
[ 44%] Building C object src/CMakeFiles/lib_darktable.dir/common/pwstorage/backend_libsecret.c.o
469
[ 44%] Building C object src/CMakeFiles/lib_darktable.dir/common/camera_control.c.o
470
[ 44%] Building C object src/CMakeFiles/lib_darktable.dir/control/jobs/camera_jobs.c.o
471
[ 44%] Building C object src/CMakeFiles/lib_darktable.dir/gui/camera_import_dialog.c.o
472
[ 44%] Building C object src/CMakeFiles/lib_darktable.dir/lua/cairo.c.o
473
[ 44%] Building C object src/CMakeFiles/lib_darktable.dir/lua/call.c.o
474
[ 46%] Building C object src/CMakeFiles/lib_darktable.dir/lua/configuration.c.o
475
[ 46%] Building C object src/CMakeFiles/lib_darktable.dir/lua/database.c.o
476
[ 46%] Building C object src/CMakeFiles/lib_darktable.dir/lua/events.c.o
477
[ 46%] Building C object src/CMakeFiles/lib_darktable.dir/lua/film.c.o
478
[ 46%] Building C object src/CMakeFiles/lib_darktable.dir/lua/format.c.o
479
[ 46%] Building C object src/CMakeFiles/lib_darktable.dir/lua/gettext.c.o
480
[ 46%] [ 46%] Building C object src/CMakeFiles/lib_darktable.dir/lua/gui.c.o
481
Building C object src/CMakeFiles/lib_darktable.dir/lua/glist.c.o
482
[ 48%] Building C object src/CMakeFiles/lib_darktable.dir/lua/guides.c.o
483
[ 48%] Building C object src/CMakeFiles/lib_darktable.dir/lua/image.c.o
484
[ 48%] Building C object src/CMakeFiles/lib_darktable.dir/lua/init.c.o
485
[ 48%] Building C object src/CMakeFiles/lib_darktable.dir/lua/lib.c.o
486
[ 48%] Building C object src/CMakeFiles/lib_darktable.dir/lua/lua.c.o
487
[ 48%] Building C object src/CMakeFiles/lib_darktable.dir/lua/lualib.c.o
488
[ 48%] Building C object src/CMakeFiles/lib_darktable.dir/lua/luastorage.c.o
489
[ 48%] Building C object src/CMakeFiles/lib_darktable.dir/lua/modules.c.o
490
[ 50%] Building C object src/CMakeFiles/lib_darktable.dir/lua/preferences.c.o
491
[ 50%] [ 50%] Building C object src/CMakeFiles/lib_darktable.dir/lua/storage.c.o
492
Building C object src/CMakeFiles/lib_darktable.dir/lua/print.c.o
493
[ 50%] Building C object src/CMakeFiles/lib_darktable.dir/lua/styles.c.o
494
[ 50%] Building C object src/CMakeFiles/lib_darktable.dir/lua/tags.c.o
495
[ 50%] Building C object src/CMakeFiles/lib_darktable.dir/lua/types.c.o
496
[ 50%] Building C object src/CMakeFiles/lib_darktable.dir/lua/view.c.o
497
[ 51%] Building C object src/CMakeFiles/lib_darktable.dir/lua/widget/widget.c.o
498
[ 51%] Building C object src/CMakeFiles/lib_darktable.dir/lua/widget/box.c.o
499
[ 51%] Building C object src/CMakeFiles/lib_darktable.dir/lua/widget/button.c.o
500
[ 51%] Building C object src/CMakeFiles/lib_darktable.dir/lua/widget/check_button.c.o
501
[ 51%] Building C object src/CMakeFiles/lib_darktable.dir/lua/widget/combobox.c.o
502
[ 51%] Building C object src/CMakeFiles/lib_darktable.dir/lua/widget/container.c.o
503
[ 51%] Building C object src/CMakeFiles/lib_darktable.dir/lua/widget/entry.c.o
504
[ 51%] Building C object src/CMakeFiles/lib_darktable.dir/lua/widget/file_chooser.c.o
505
[ 53%] Building C object src/CMakeFiles/lib_darktable.dir/lua/widget/label.c.o
506
[ 53%] Building C object src/CMakeFiles/lib_darktable.dir/lua/widget/separator.c.o
507
[ 53%] Building C object src/CMakeFiles/lib_darktable.dir/lua/widget/slider.c.o
508
[ 53%] Building C object src/CMakeFiles/lib_darktable.dir/lua/widget/stack.c.o
509
Linking C shared library libdarktable.so
510
[ 53%] Built target lib_darktable
511
Scanning dependencies of target lighttable
512
[ 53%] Building C object src/views/CMakeFiles/lighttable.dir/lighttable.c.o
513
Scanning dependencies of target darktable
514
Scanning dependencies of target darkroom
515
Scanning dependencies of target map
516
[ 53%] Building C object src/CMakeFiles/darktable.dir/main.c.o
517
[ 53%] [ 55%] Building C object src/views/CMakeFiles/map.dir/map.c.o
518
Building C object src/views/CMakeFiles/darkroom.dir/darkroom.c.o
519
Linking C executable darktable
520
[ 55%] Built target darktable
521
/home/chri/Linux/darktable/src/views/map.c: In function ‘_view_map_center_on_bbox’:
522
/home/chri/Linux/darktable/src/views/map.c:847:3: error: implicit declaration of function ‘osm_gps_map_zoom_fit_bbox’ [-Werror=implicit-function-declaration]
523
   osm_gps_map_zoom_fit_bbox(lib->map, lat1, lat2, lon1, lon2);
524
   ^
525
/home/chri/Linux/darktable/src/views/map.c: At top level:
526
/home/chri/Linux/darktable/src/views/map.c:903:8: error: unknown type name ‘OsmGpsMapPolygon’
527
 static OsmGpsMapPolygon *_view_map_add_polygon(const dt_view_t *view, GList *points)
528
        ^
529
/home/chri/Linux/darktable/src/views/map.c: In function ‘_view_map_add_polygon’:
530
/home/chri/Linux/darktable/src/views/map.c:907:3: error: unknown type name ‘OsmGpsMapPolygon’
531
   OsmGpsMapPolygon *poly = osm_gps_map_polygon_new();
532
   ^
533
/home/chri/Linux/darktable/src/views/map.c:907:3: error: implicit declaration of function ‘osm_gps_map_polygon_new’ [-Werror=implicit-function-declaration]
534
/home/chri/Linux/darktable/src/views/map.c:907:28: error: initialization makes pointer from integer without a cast [-Werror]
535
   OsmGpsMapPolygon *poly = osm_gps_map_polygon_new();
536
                            ^
537
/home/chri/Linux/darktable/src/views/map.c:920:3: error: implicit declaration of function ‘osm_gps_map_polygon_add’ [-Werror=implicit-function-declaration]
538
   osm_gps_map_polygon_add(lib->map, poly);
539
   ^
540
/home/chri/Linux/darktable/src/views/map.c: At top level:
541
/home/chri/Linux/darktable/src/views/map.c:925:65: error: unknown type name ‘OsmGpsMapPolygon’
542
 static gboolean _view_map_remove_polygon(const dt_view_t *view, OsmGpsMapPolygon *polygon)
543
                                                                 ^
544
/home/chri/Linux/darktable/src/views/map.c: In function ‘_view_map_remove_marker’:
545
/home/chri/Linux/darktable/src/views/map.c:976:5: error: implicit declaration of function ‘_view_map_remove_polygon’ [-Werror=implicit-function-declaration]
546
     case MAP_DISPLAY_POLYGON: return _view_map_remove_polygon(view, OSM_GPS_MAP_POLYGON(marker));
547
     ^
548
/home/chri/Linux/darktable/src/views/map.c:976:5: error: implicit declaration of function ‘OSM_GPS_MAP_POLYGON’ [-Werror=implicit-function-declaration]
549
cc1: all warnings being treated as errors
550
src/views/CMakeFiles/map.dir/build.make:54: recipe for target 'src/views/CMakeFiles/map.dir/map.c.o' failed
551
make[2]: *** [src/views/CMakeFiles/map.dir/map.c.o] Error 1
552
CMakeFiles/Makefile2:1442: recipe for target 'src/views/CMakeFiles/map.dir/all' failed
553
make[1]: *** [src/views/CMakeFiles/map.dir/all] Error 2
554
make[1]: *** Warte auf noch nicht beendete Prozesse...
555
Scanning dependencies of target slideshow
556
[ 55%] Building C object src/views/CMakeFiles/slideshow.dir/slideshow.c.o
557
Linking C shared module libdarkroom.so
558
[ 55%] Built target darkroom
559
Linking C shared module libslideshow.so
560
[ 55%] Built target slideshow
561
Linking C shared module liblighttable.so
562
[ 55%] Built target lighttable
563
Makefile:137: recipe for target 'all' failed
564
make: *** [all] Error 2
Go to top